Target
D(2) dopamine receptor
Ligand
BDBM50004919
Substrate
Ki
209±n/a nM
Comments
PDSP_4929
Citation
 Neumeyer, JLKula, NSBergman, JBaldessarini, RJ Receptor affinities of dopamine D1 receptor-selective novel phenylbenzazepines. Eur J Pharmacol 474:137-40 (2003)  
Target
Name:
D(2) dopamine receptor
Synonyms:
DOPAMINE D2 DOPAMINE D2 Short Dopamine D2 receptor Drd2
Type:
G Protein-Coupled Receptor (GPCR)
Mol. Mass.:
50931.60
Organism:
Rattus norvegicus (rat)
Description:
P61169
Residue:
444
  
Inhibitor
Name:
BDBM50004919
Synonyms:
(R)(+)-BrAPB S-(-)-6-Br-APD3-Allyl-6-bromo-1-phenyl-2,3,4,5-tetrahydro-1H-benzo[d]azepine-7,8-diol
Type:
Small organic molecule
Emp. Form.:
C19H20BrNO2
Mol. Mass.:
374.272
SMILES:
Oc1cc2[C@@H](CN(CC=C)CCc2c(Br)c1O)c1ccccc1
: