Target
Tyrosine-protein kinase JAK1
Ligand
BDBM277493
Substrate
Meas. Tech.
Biochemical JAK Assay
pH
7.5±n/a
Ki
0.55±n/a nM
Comments
extracted
Citation
 Huang, XThalladi, VR Crystalline form of 3-((1R,3s,5S)-3-((7-((5-methyl-1H-pyrazol-3-yl)amino)-1,6-naphthyridin-5-yl)amino)-8-azabicyclo[3.2.1]octan-8-yl)propanenitrile US Patent  US10072026 Publication Date 9/11/2018 
Target
Name:
Tyrosine-protein kinase JAK1
Synonyms:
JAK-1 JAK1A JAK1_HUMAN Janus kinase 1 (JAK1) | Janus kinase 1 JAK1
Type:
Protein
Mol. Mass.:
133293.73
Organism:
Homo sapiens (Human)
Description:
P23458
Residue:
1154
  
Inhibitor
Name:
BDBM277493
Synonyms:
US10072026, Example 2-29 | US10947254, Example 2-29
Type:
Small organic molecule
Emp. Form.:
C25H30N8O
Mol. Mass.:
458.5587
SMILES:
CC(CC#N)C(=O)N1[C@H]2CCC[C@@H]1C[C@H](C2)Nc1nc(Nc2cc(C)[nH]n2)cc2ncccc12
: