Target
Interleukin-8
Ligand
BDBM277686
Substrate
Meas. Tech.
PBMC Cell Assay
IC50
5.60±n/a nM
Citation
 Fyfe, MCThom, SM Kinase inhibitors US Patent  US10072034 Publication Date 9/11/2018 
Target
Name:
Interleukin-8
Synonyms:
CXCL8 IL8_HUMAN interleukin 8 precursor
Type:
PROTEIN
Mol. Mass.:
11104.05
Organism:
Homo sapiens (Human)
Description:
ChEMBL_577736
Residue:
99
  
Inhibitor
Name:
BDBM277686
Synonyms:
5-((2-(3-((4-((4-(3-(5-(tert-Butyl)-2-methoxy-3-(methylsulfonamido)phenyl) ureido)naphthalen-1 yl)oxy)pyridin-2-yl)amino)-5-methoxyphenoxy)ethoxy)methyl)furan-3-carboxylic acid | US10072034, Example 12
Type:
Small organic molecule
Emp. Form.:
C43H45N5O11S
Mol. Mass.:
839.909
SMILES:
COc1cc(Nc2cc(Oc3ccc(NC(=O)Nc4cc(cc(NS(C)(=O)=O)c4OC)C(C)(C)C)c4ccccc34)ccn2)cc(OCCOCc2cc(co2)C(O)=O)c1
: