Target
Protein kinase C delta type
Ligand
BDBM86435
Substrate
Ki
11.6±n/a nM
Comments
PDSP_3231
Citation
 Wang, QJFang, TWYang, DLewin, NEVan Lint, JMarquez, VEBlumberg, PM Ligand structure-activity requirements and phospholipid dependence for the binding of phorbol esters to protein kinase D. Mol Pharmacol 64:1342-8 (2003)  
Target
Name:
Protein kinase C delta type
Synonyms:
KPCD_HUMAN PKCD Protein Kinase C- delta nPKC-delta
Type:
Enzyme
Mol. Mass.:
77516.79
Organism:
Homo sapiens (Human)
Description:
The recombinant human PKC enzymes were produced using a baculovirus expression system in SF9 cells
Residue:
676
  
Inhibitor
Name:
BDBM86435
Synonyms:
B8-DL-B8 | B8-DL-B8 (low PS)
Type:
Small organic molecule
Emp. Form.:
C24H42O5
Mol. Mass.:
410.5873
SMILES:
CCC(C)(C\C=C1\CC(CO)(COC(=O)CC(C)(CC)C(C)C)OC1=O)C(C)C
: