Target
Polycystin-1
Ligand
BDBM86435
Substrate
Ki
10.8±n/a nM
Comments
PDSP_3231
Citation
 Wang, QJFang, TWYang, DLewin, NEVan Lint, JMarquez, VEBlumberg, PM Ligand structure-activity requirements and phospholipid dependence for the binding of phorbol esters to protein kinase D. Mol Pharmacol 64:1342-8 (2003)  
Target
Name:
Polycystin-1
Synonyms:
PKD1 Protein Kinase D-GST
Type:
Enzyme Catalytic Domain
Mol. Mass.:
462537.85
Organism:
Homo sapiens (Human)
Description:
Protein Kinase D-GST 0 HUMAN::P98161
Residue:
4303
  
Inhibitor
Name:
BDBM86435
Synonyms:
B8-DL-B8 | B8-DL-B8 (low PS)
Type:
Small organic molecule
Emp. Form.:
C24H42O5
Mol. Mass.:
410.5873
SMILES:
CCC(C)(C\C=C1\CC(CO)(COC(=O)CC(C)(CC)C(C)C)OC1=O)C(C)C
: