Target
Epidermal growth factor receptor
Ligand
BDBM3583
Substrate
EGF-R Substrate
Meas. Tech.
Kinase Inhibition Assay
pH
7.4±n/a
Temperature
295.15±n/a K
IC50
0.44±n/a nM
Citation
 Rewcastle, GWPalmer, BDBridges, AJShowalter, HDSun, LNelson, JMcMichael, AKraker, AJFry, DWDenny, WA Tyrosine kinase inhibitors. 9. Synthesis and evaluation of fused tricyclic quinazoline analogues as ATP site inhibitors of the tyrosine kinase activity of the epidermal growth factor receptor. J Med Chem 39:918-28 (1996)  
Target
Name:
Epidermal growth factor receptor
Synonyms:
EGF Receptor Substrate EGFR_HUMAN ERBB1 Epidermal Growth Factor Receptor erbB-1 Epidermal growth factor receptor (EGFR) HER1 Proto-oncogene c-ErbB-1 Tyrosine-Protein Kinase ErbB-1
Type:
Receptor Kinase Domain
Mol. Mass.:
134279.59
Organism:
Homo sapiens (Human)
Description:
P00533
Residue:
1210
  
Inhibitor
Name:
BDBM3583
Synonyms:
5-[(3-Bromophenyl)amino]-1H-pyrrolo[3,2-g]quinazoline N-(3-bromophenyl)-8H-pyrrolo[3,2-g]quinazolin-4-amine Pyrroloquinazoline deriv. 3a
Type:
Small organic molecule
Emp. Form.:
C16H11BrN4
Mol. Mass.:
339.189
SMILES:
Brc1cccc(Nc2ncnc3cc4[nH]ccc4cc23)c1
:
Substrate
Name:
EGF-R Substrate
Synonyms:
Type:
Peptide
Mol. Mass.:
4119.23
Organism:
Description:
The sequence is based on a portion of phospholipase C-gamma. 10 uM ATP containing 1 uCi of [gamma-32P]ATP as co-substrate.
Residue:
38