Target
Epidermal growth factor receptor
Ligand
BDBM50049572
Substrate
Meas. Tech.
Kinase Inhibition Assay
IC50
27±n/a nM
Citation
 Rewcastle, GWPalmer, BDThompson, AWBridges, AJCody, DRZhou, HRFry, DWMcMichael, ADenny, WA Tyrosine Kinase Inhibitors. 10. Isomeric 4-[(3-Bromophenyl)amino]pyrido[d]- pyrimidines Are Potent ATP Binding Site Inhibitors of the Tyrosine Kinase Function of the Epidermal Growth Factor Receptor J Med Chem 39:1823-35 (1996)  
Target
Name:
Epidermal growth factor receptor
Synonyms:
EGF Receptor Substrate EGFR_HUMAN ERBB1 Epidermal Growth Factor Receptor erbB-1 Epidermal growth factor receptor (EGFR) HER1 Proto-oncogene c-ErbB-1 Tyrosine-Protein Kinase ErbB-1
Type:
Receptor Kinase Domain
Mol. Mass.:
134279.59
Organism:
Homo sapiens (Human)
Description:
P00533
Residue:
1210
  
Inhibitor
Name:
BDBM50049572
Synonyms:
1,3-benzodiazine 5,6-benzopyrimidine Chinazolin benzo[a]pyrimidine quinazoline
Type:
Small organic molecule
Emp. Form.:
C8H6N2
Mol. Mass.:
130.1466
SMILES:
c1ccc2ncncc2c1
: