Target
Gamma-aminobutyric acid receptor subunit alpha-1
Ligand
BDBM86521
Substrate
Ki
59.8±n/a nM
Comments
PDSP_3733
Citation
 Sullivan, SKPetroski, REVerge, GGross, RSFoster, ACGrigoriadis, DE Characterization of the interaction of indiplon, a novel pyrazolopyrimidine sedative-hypnotic, with the GABAA receptor. J Pharmacol Exp Ther 311:537-46 (2004)  
Target
Name:
Gamma-aminobutyric acid receptor subunit alpha-1
Synonyms:
Benzodiazepine central GABA A Benzodiazepine GABA A Benzodiazepine Type II GABA A Benzodiazepine Type IIM GABA A Benzodiazepine omega2 GABA A alpha1 GABA receptor alpha-1 subunit GABA-PICROTOXIN Gabra-1 TBPS
Type:
Enzyme
Mol. Mass.:
51770.21
Organism:
Rattus norvegicus (Rat)
Description:
P62813
Residue:
455
  
Inhibitor
Name:
BDBM86521
Synonyms:
CAS_5719 Zaleplon
Type:
Small organic molecule
Emp. Form.:
C17H15N5O
Mol. Mass.:
305.3339
SMILES:
CCN(C(C)=O)c1cccc(c1)-c1ccnc2c(cnn12)C#N
: