Target
5-hydroxytryptamine receptor 2A
Ligand
BDBM85533
Substrate
Ki
30.20±n/a nM
Comments
PDSP_1420
Citation
 Knight, ARMisra, AQuirk, KBenwell, KRevell, DKennett, GBickerdike, M Pharmacological characterisation of the agonist radioligand binding site of 5-HT(2A), 5-HT(2B) and 5-HT(2C) receptors. Naunyn Schmiedebergs Arch Pharmacol 370:114-23 (2004)  
Target
Name:
5-hydroxytryptamine receptor 2A
Synonyms:
5-HT-2 5-HT2A 5-hydroxytryptamine receptor 2A (5HT-2A) 5HT2A_HUMAN HTR2A | Serotonin receptor 2A
Type:
undefined
Mol. Mass.:
52607.65
Organism:
Homo sapiens (Human)
Description:
P28223
Residue:
471
  
Inhibitor
Name:
BDBM85533
Synonyms:
2-Chloro-3-(trifluoromethyl)-6-(1-piperazinyl)pyridine | ORG-12962
Type:
Small organic molecule
Emp. Form.:
C10H11ClF3N3
Mol. Mass.:
265.663
SMILES:
FC(F)(F)c1ccc(nc1Cl)N1CCNCC1
: