Target
5-hydroxytryptamine receptor 2B
Ligand
BDBM85533
Substrate
Ki
91.20±n/a nM
Comments
PDSP_1420
Citation
 Knight, ARMisra, AQuirk, KBenwell, KRevell, DKennett, GBickerdike, M Pharmacological characterisation of the agonist radioligand binding site of 5-HT(2A), 5-HT(2B) and 5-HT(2C) receptors. Naunyn Schmiedebergs Arch Pharmacol 370:114-23 (2004)  
Target
Name:
5-hydroxytryptamine receptor 2B
Synonyms:
5-HT-2B 5-hydroxytryptamine (serotonin) receptor 2B [Homo sapiens] 5-hydroxytryptamine receptor 2C (5HT2C) HTR2B Serotonin 2b (5-HT2b) receptor | Serotonin Receptor 2B
Type:
G Protein-Coupled Receptor (GPCR)
Mol. Mass.:
54312.47
Organism:
Homo sapiens (Human)
Description:
Receptor binding assays were performed using human clone stably expressed in CHO cells.
Residue:
481
  
Inhibitor
Name:
BDBM85533
Synonyms:
2-Chloro-3-(trifluoromethyl)-6-(1-piperazinyl)pyridine | ORG-12962
Type:
Small organic molecule
Emp. Form.:
C10H11ClF3N3
Mol. Mass.:
265.663
SMILES:
FC(F)(F)c1ccc(nc1Cl)N1CCNCC1
: