Target
5-hydroxytryptamine receptor 2C
Ligand
BDBM85533
Substrate
Ki
14.79±n/a nM
Comments
PDSP_1420
Citation
 Knight, ARMisra, AQuirk, KBenwell, KRevell, DKennett, GBickerdike, M Pharmacological characterisation of the agonist radioligand binding site of 5-HT(2A), 5-HT(2B) and 5-HT(2C) receptors. Naunyn Schmiedebergs Arch Pharmacol 370:114-23 (2004)  
Target
Name:
5-hydroxytryptamine receptor 2C
Synonyms:
5-HT-1C 5-HT1C 5-HT2C-INI 5-HTR2C 5-hydroxytryptamine receptor 2C (5-HT-2C) 5HT-1C HTR1C Serotonin (5-HT3) receptor Serotonin Receptor 2C
Type:
G Protein-Coupled Receptor (GPCR)
Mol. Mass.:
51836.79
Organism:
Homo sapiens (Human)
Description:
P28335
Residue:
458
  
Inhibitor
Name:
BDBM85533
Synonyms:
2-Chloro-3-(trifluoromethyl)-6-(1-piperazinyl)pyridine | ORG-12962
Type:
Small organic molecule
Emp. Form.:
C10H11ClF3N3
Mol. Mass.:
265.663
SMILES:
FC(F)(F)c1ccc(nc1Cl)N1CCNCC1
: