Target
Delta-type opioid receptor
Ligand
BDBM86513
Substrate
Ki
9.41±n/a nM
Comments
PDSP_3707
Citation
 Tryoen-Tóth, PDécaillot, FMFilliol, DBefort, KLazarus, LHSchiller, PWSchmidhammer, HKieffer, BL Inverse agonism and neutral antagonism at wild-type and constitutively active mutant delta opioid receptors. J Pharmacol Exp Ther 313:410-21 (2005)  
Target
Name:
Delta-type opioid receptor
Synonyms:
D-OR-1 Delta opioid receptor OPIATE Delta OPRD1 OPRK1 | opioid receptor, delta 1
Type:
G Protein-Coupled Receptor (GPCR)
Mol. Mass.:
40382.98
Organism:
Homo sapiens (Human)
Description:
Competition binding assays were carried out using membrane preparations from transfected HN9.10 cells that constitutively expressed the delta opioid receptor.
Residue:
372
  
Inhibitor
Name:
BDBM86513
Synonyms:
CAS_123924 SNC-80
Type:
Small organic molecule
Emp. Form.:
C28H39N3O2
Mol. Mass.:
449.6282
SMILES:
CCN(CC)C(=O)c1ccc(cc1)C(N1CC(C)N(CC=C)CC1C)c1cccc(OC)c1
: