Target
Metabotropic glutamate receptor 5
Ligand
BDBM50122758
Substrate
Ki
17.8±n/a nM
Comments
PDSP_4885
Citation
 Porter, RHJaeschke, GSpooren, WBallard, TMBüttelmann, BKolczewski, SPeters, JUPrinssen, EWichmann, JVieira, EMühlemann, AGatti, SMutel, VMalherbe, P Fenobam: a clinically validated nonbenzodiazepine anxiolytic is a potent, selective, and noncompetitive mGlu5 receptor antagonist with inverse agonist activity. J Pharmacol Exp Ther 315:711-21 (2005)  
Target
Name:
Metabotropic glutamate receptor 5
Synonyms:
GRM5_RAT Grm5 Mglur5 metabotropic glutamate 5/1-C metabotropic glutamate 5a
Type:
Enzyme
Mol. Mass.:
131900.14
Organism:
Rattus norvegicus (Rat)
Description:
P31424
Residue:
1203
  
Inhibitor
Name:
BDBM50122758
Synonyms:
2-methyl-4-(pyridin-3-ylethynyl)thiazole 3-(2-Methyl-thiazol-4-ylethynyl)-pyridine 3-[(2-methyl-4-thiazolyl)ethynyl]pyridine MTEP
Type:
Small organic molecule
Emp. Form.:
C11H8N2S
Mol. Mass.:
200.26
SMILES:
Cc1nc(cs1)C#Cc1cccnc1
: