Target
Rho-associated protein kinase 2
Ligand
BDBM86727
Substrate
Ki
450±n/a nM
Comments
PDSP_6134
Citation
 Braverman, ASTibb, ASRuggieri, MR M2 and M3 muscarinic receptor activation of urinary bladder contractile signal transduction. I. Normal rat bladder. J Pharmacol Exp Ther 316:869-74 (2006)  
Target
Name:
Rho-associated protein kinase 2
Synonyms:
ROCK2_RAT Rho-associated protein kinase 2 Rho-associated, coiled-coil-containing protein kinase 2 RhoA-binding kinase 2 p150 ROK-alpha
Type:
Protein
Mol. Mass.:
160370.90
Organism:
Rattus norvegicus (Rat)
Description:
Q62868
Residue:
1388
  
Inhibitor
Name:
BDBM86727
Synonyms:
1-(5-isoquinolinesulfonyl)-2-methylpiperazine.2HCl | CAS_140663-38-3
Type:
Small organic molecule
Emp. Form.:
C14H17N3O2S
Mol. Mass.:
291.369
SMILES:
CC1CN(CCN1)S(=O)(=O)c1cccc2cnccc12
: