Target
5-hydroxytryptamine receptor 6
Ligand
BDBM86708
Substrate
Ki
>10000±n/a nM
Comments
PDSP_1954
Citation
 Chemel, BRRoth, BLArmbruster, BWatts, VJNichols, DE WAY-100635 is a potent dopamine D4 receptor agonist. Psychopharmacology (Berl) 188:244-51 (2006)  
Target
Name:
5-hydroxytryptamine receptor 6
Synonyms:
5-HT-6 5-hydroxytryptamine receptor 6 (5-HT-6) 5-hydroxytryptamine receptor 6 (5HT6) HTR6 Serotonin 6 (5-HT6) receptor | Serotonin Receptor 6
Type:
G Protein-Coupled Receptor (GPCR)
Mol. Mass.:
46968.43
Organism:
Homo sapiens (Human)
Description:
P50406
Residue:
440
  
Inhibitor
Name:
BDBM86708
Synonyms:
CAS_146714-97-8 CHEMBL514874 NSC_104911 | WAY 100,635
Type:
Small organic molecule
Emp. Form.:
C25H34N4O2
Mol. Mass.:
422.5631
SMILES:
COc1ccccc1N1CCN(CCN(C(=O)C2CCCCC2)c2ccccn2)CC1
: