Target
Proto-oncogene tyrosine-protein kinase Src
Ligand
BDBM86863
Substrate
Ki
64±n/a nM
Comments
PDSP_8411
Citation
 Radi, MCrespan, EBotta, GFalchi, FMaga, GManetti, FCorradi, VMancini, MSantucci, MASchenone, SBotta, M Discovery and SAR of 1,3,4-thiadiazole derivatives as potent Abl tyrosine kinase inhibitors and cytodifferentiating agents. Bioorg Med Chem Lett 18:1207-11 (2008)  
Target
Name:
Proto-oncogene tyrosine-protein kinase Src
Synonyms:
Calmodulin/Proto-oncogene tyrosine-protein kinase Src Proto-oncogene c-Src SRC SRC_HUMAN V-src sarcoma (Schmidt-Ruppin A-2) viral oncogene homolog (avian) p60-Src | pp60c-src
Type:
Protein
Mol. Mass.:
59838.60
Organism:
Homo sapiens (Human)
Description:
P12931
Residue:
536
  
Inhibitor
Name:
BDBM86863
Synonyms:
CAS_4390766 NSC_4390766
Type:
Small organic molecule
Emp. Form.:
C16H11ClFN3OS2
Mol. Mass.:
379.859
SMILES:
Fc1cccc(CSc2nnc(NC(=O)c3ccc(Cl)cc3)s2)c1
: