Target
Cannabinoid receptor 1
Ligand
BDBM86998
Substrate
Ki
1±n/a nM
Comments
PDSP_8486
Citation
 Alig, LAlsenz, JAndjelkovic, MBendels, SBénardeau, ABleicher, KBourson, ADavid-Pierson, PGuba, WHildbrand, SKube, DLübbers, TMayweg, AVNarquizian, RNeidhart, WNettekoven, MPlancher, JMRocha, CRogers-Evans, MRöver, SSchneider, GTaylor, SWaldmeier, P Benzodioxoles: novel cannabinoid-1 receptor inverse agonists for the treatment of obesity. J Med Chem 51:2115-27 (2008)  
Target
Name:
Cannabinoid receptor 1
Synonyms:
CANN6 CB-R CNR CNR1_HUMAN Cannabinoid receptor Cannabinoid receptor 1 (brain)
Type:
G Protein-Coupled Receptor (GPCR)
Mol. Mass.:
52868.96
Organism:
Homo sapiens (Human)
Description:
P21554
Residue:
472
  
Inhibitor
Name:
BDBM86998
Synonyms:
(2,2-bis(2,4-difluorophenyl)-6-fluorobenzo[d][1,3]dioxol-5-yl)(piperidin-1-yl)methanone NSC_22475030
Type:
Small organic molecule
Emp. Form.:
C25H18F5NO3
Mol. Mass.:
475.4073
SMILES:
Fc1ccc(c(F)c1)C1(Oc2cc(F)c(cc2O1)C(=O)N1CCCCC1)c1ccc(F)cc1F
: