Target
GTP-binding nuclear protein GSP2/CNR2
Ligand
BDBM29094
Substrate
Ki
7943±n/a nM
Comments
PDSP_8426
Citation
 Wang, HDuffy, RABoykow, GCChackalamannil, SMadison, VS Identification of novel cannabinoid CB1 receptor antagonists by using virtual screening with a pharmacophore model. J Med Chem 51:2439-46 (2008)  
Target
Name:
GTP-binding nuclear protein GSP2/CNR2
Synonyms:
CANNABINOID CB2 GSP2 GTP-binding nuclear protein GSP2/CNR2
Type:
Enzyme Catalytic Domain
Mol. Mass.:
24990.72
Organism:
Saccharomyces cerevisiae
Description:
CANNABINOID CB2 CNR2 0::P32836
Residue:
220
  
Inhibitor
Name:
BDBM29094
Synonyms:
(+/-)-SLV319 3-(4-chlorophenyl)-N''''-(4-chlorophenylsulfonyl)-N-methyl-4-phenyl-4,5-dihydro-1H-pyrazole-1-carboximidamide CHEMBL158784 ibipinabant
Type:
Small organic molecule
Emp. Form.:
C23H20Cl2N4O2S
Mol. Mass.:
487.402
SMILES:
CN=C(NS(=O)(=O)c1ccc(Cl)cc1)N1CC(C(=N1)c1ccc(Cl)cc1)c1ccccc1
: