Target
DNA (cytosine-5)-methyltransferase 1
Ligand
BDBM53267
Substrate
Meas. Tech.
Dose response confirmation of DNMT1 inhibitors in a Fluorescent Molecular Beacon assay
IC50
3500±123 nM
Citation
 PubChem, PC Dose response confirmation of DNMT1 inhibitors in a Fluorescent Molecular Beacon assay PubChem Bioassay (2012)[AID] 
Target
Name:
DNA (cytosine-5)-methyltransferase 1
Synonyms:
AIM CXXC9 DNA (cytosine-5)-methyltransferase 1 isoform b DNA methyltransferase HsaI DNMT1 M.HsaI | MCMT
Type:
Enzyme
Mol. Mass.:
183184.85
Organism:
Homo sapiens (Human)
Description:
P26358
Residue:
1616
  
Inhibitor
Name:
BDBM53267
Synonyms:
4-[2-[(E)-[2,4-bis(oxidanylidene)-3-(2-oxidanylidene-2-pyrrolidin-1-yl-ethyl)-1,3-thiazolidin-5-ylidene]methyl]pyrrol-1-yl]benzoic acid 4-[2-[(E)-[2,4-dioxo-3-(2-oxo-2-pyrrolidin-1-ylethyl)-1,3-thiazolidin-5-ylidene]methyl]pyrrol-1-yl]benzoic acid 4-{2-[2,4-Dioxo-3-(2-oxo-2-pyrrolidin-1-yl-ethyl)-thiazolidin-(5E)-ylidenemethyl]-pyrrol-1-yl}-benzoic acid SMR000605630 | cid_6490291
Type:
Small organic molecule
Emp. Form.:
C21H19N3O5S
Mol. Mass.:
425.458
SMILES:
OC(=O)c1ccc(cc1)-n1cccc1\C=C1\SC(=O)N(CC(=O)N2CCCC2)C1=O
: