Target
Corticotropin-releasing factor-binding protein
Ligand
BDBM90804
Substrate
Meas. Tech.
Dose Response confirmation of uHTS hits for small molecule agonists of the CRF-binding protein and CRF-R2 receptor complex
EC50
>53000±n/a nM
Citation
 PubChem, PC Dose Response confirmation of uHTS hits for small molecule agonists of the CRF-binding protein and CRF-R2 receptor complex PubChem Bioassay (2012)[AID] 
Target
Name:
Corticotropin-releasing factor-binding protein
Synonyms:
CRFBP CRHBP_HUMAN | corticotropin releasing factor-binding protein
Type:
Enzyme Catalytic Domain
Mol. Mass.:
36143.95
Organism:
Homo sapiens (Human)
Description:
P24387
Residue:
322
  
Inhibitor
Name:
BDBM90804
Synonyms:
MLS001180481 N,N'-bis(2,4-dimethoxyphenyl)hexanediamide SMR000476730 | cid_4601418
Type:
Small organic molecule
Emp. Form.:
C22H28N2O6
Mol. Mass.:
416.4675
SMILES:
COc1ccc(NC(=O)CCCCC(=O)Nc2ccc(OC)cc2OC)c(OC)c1
: