Target
Lethal factor
Ligand
BDBM54607
Substrate
Meas. Tech.
High-throughput multiplex microsphere dose response for inhibitors of toxin protease, specifically Lethal Factor protease, compounds from Powder Set 01
EC50
>20000±n/a nM
Citation
 PubChem, PC High-throughput multiplex microsphere dose response for inhibitors of toxin protease, specifically Lethal Factor protease, compounds from Powder Set 01 PubChem Bioassay (2012)[AID] 
Target
Name:
Lethal factor
Synonyms:
Anthrax Lethal Factor (LF) Antrax lethal toxin lef | lethal factor
Type:
PROTEIN
Mol. Mass.:
93758.56
Organism:
Bacillus anthracis
Description:
ChEMBL_1460338
Residue:
809
  
Inhibitor
Name:
BDBM54607
Synonyms:
4-(2,5-diphenyl-3,4-dihydropyrazol-3-yl)-N,N-dimethyl-aniline UNM-0000305845 cid_2729182
Type:
Small organic molecule
Emp. Form.:
C23H23N3
Mol. Mass.:
341.4488
SMILES:
CN(C)c1ccc(cc1)C1CC(=NN1c1ccccc1)c1ccccc1
: