Target
Prostaglandin G/H synthase 2
Ligand
BDBM91685
Substrate
Meas. Tech.
Enzyme Inhibition Assay
IC50
9.2e+2± 2e+1 nM
Citation
 Bekhit, AAAshour, HMBekhit, Ael-DAbdel-Rahman, HMBekhit, SA Synthesis of some pyrazolyl benzenesulfonamide derivatives as dual anti-inflammatory antimicrobial agents. J Enzyme Inhib Med Chem 24:296-309 (2009)  
Target
Name:
Prostaglandin G/H synthase 2
Synonyms:
COX2 Cyclooxygenase 2 (COX-2) Cyclooxygenase-2 (COX-2 AA) Cyclooxygenase-2 (COX-2) PGH2_HUMAN PHS II Prostaglandin E synthase/G/H synthase 2 Prostaglandin-endoperoxide synthase 2
Type:
Enzyme
Mol. Mass.:
69003.89
Organism:
Homo sapiens (Human)
Description:
Recombinant Cox-2 provided by Cayman (Cayman Chemical Co.,Ann Arbor, MI).
Residue:
604
  
Inhibitor
Name:
BDBM91685
Synonyms:
Pyrazolyl benzenesulfonamide derivative, 9b
Type:
Small organic molecule
Emp. Form.:
C17H14N4O2S
Mol. Mass.:
338.384
SMILES:
Cc1ccc(cc1)-c1nn(cc1C#N)-c1ccc(cc1)S(N)(=O)=O
: