Target
Cholinesterase
Ligand
BDBM91726
Substrate
Meas. Tech.
Inhibition Assay
pH
7.4±0
Temperature
310.15±0 K
IC50
5.240e+6± 8.02e+4 nM
Kd
4.370e+6± 1.62e+4 nM
Citation
 Gholivand, KAbdollahi, MMojahed, FAlizadehgan, AMDehghan, G Acetylcholinesterase/butyrylcholinesterase inhibition activity of some new carbacylamidophosphate derivatives. J Enzyme Inhib Med Chem 24:566-76 (2009)  
Target
Name:
Cholinesterase
Synonyms:
Acylcholine acylhydrolase Butyrylcholine esterase (BChE) Butyrylcholinesterase (BuChE) CHLE_HUMAN Cholinesterases Pseudocholinesterase
Type:
Homotetramer
Mol. Mass.:
68422.27
Organism:
Homo sapiens (Human)
Description:
P06276
Residue:
602
  
Inhibitor
Name:
BDBM91726
Synonyms:
Carbacylamidophosphate, 2b
Type:
Small organic molecule
Emp. Form.:
C15H21BrN3O4P
Mol. Mass.:
418.223
SMILES:
Brc1ccc(cc1)C(=O)NP(=O)(N1CCOCC1)N1CCOCC1
: