Target
Cyclin-dependent kinase 2
Ligand
BDBM7132
Substrate
Meas. Tech.
OctetRed
pH
7.5±n/a
Temperature
298.15±n/a K
Kd
808±114 nM
Citation
 CSARdock, CD CDK2 in CSAR_FULL_RELEASE_3JULY2012 CSAR 1:0 (2012)  
Target
Name:
Cyclin-dependent kinase 2
Synonyms:
CDK2 CDK2_HUMAN Cell division protein kinase 2 Protein cereblon/Cyclin-dependent kinase 2 | p33 protein kinase
Type:
Enzyme Subunit
Mol. Mass.:
33938.17
Organism:
Homo sapiens (Human)
Description:
P24941
Residue:
298
  
Inhibitor
Name:
BDBM7132
Synonyms:
1-N-(5-cyclopropyl-1H-pyrazol-3-yl)benzene-1,4-dicarboxamide CHEMBL325606 | CS3
Type:
Small organic molecule
Emp. Form.:
C14H14N4O2
Mol. Mass.:
270.2866
SMILES:
NC(=O)c1ccc(cc1)C(=O)Nc1cc(n[nH]1)C1CC1
: