Target
cAMP-specific 3',5'-cyclic phosphodiesterase 4D
Ligand
BDBM50020875
Substrate
Meas. Tech.
Enzymatic Assay
pH
7.5±0
Temperature
297.15±0 K
IC50
2e+3±n/a nM
Citation
 Wang, HKunz, SChen, GSeebeck, TWan, YRobinson, HMartinelli, SKe, H Biological and structural characterization of Trypanosoma cruzi phosphodiesterase C and Implications for design of parasite selective inhibitors. J Biol Chem 287:11788-97 (2012)  
Target
Name:
cAMP-specific 3',5'-cyclic phosphodiesterase 4D
Synonyms:
3',5'-cyclic phosphodiesterase PDE43 PDE4D_HUMAN | Phosphodiesterase 4D
Type:
Protein
Mol. Mass.:
91092.69
Organism:
Homo sapiens (Human)
Description:
Q08499
Residue:
809
  
Inhibitor
Name:
BDBM50020875
Synonyms:
1-Ethyl-4-(N'-isopropylidene-hydrazino)-1H-pyrazolo[3,4-b]pyridine-5-carboxylic acid ethyl ester ETAZOLATE
Type:
Small organic molecule
Emp. Form.:
C14H19N5O2
Mol. Mass.:
289.333
SMILES:
CCOC(=O)c1cnc2n(CC)ncc2c1N=NC(C)C
: