Target
Dual specificity mitogen-activated protein kinase kinase 6
Ligand
BDBM29678
Substrate
Meas. Tech.
Fluorescence Polarization (FP) Assay
IC50
>2.50e+5±n/a nM
Citation
 Bannwarth, LGoldberg, ABChen, CTurk, BE Identification of exosite-targeting inhibitors of anthrax lethal factor by high-throughput screening. Chem Biol 19:875-82 (2012)  
Target
Name:
Dual specificity mitogen-activated protein kinase kinase 6
Synonyms:
Dual specificity mitogen-activated protein kinase kinase 6 MAP2K6 MAPKK 6 MKK6 Mitogen-activated protein kinase kinase 6 (MKK6) SAPKK3 | SKK3
Type:
Protein
Mol. Mass.:
37494.96
Organism:
Homo sapiens (Human)
Description:
P52564
Residue:
334
  
Inhibitor
Name:
BDBM29678
Synonyms:
Reduced parellic acid, 9
Type:
Small organic molecule
Emp. Form.:
C18H16O8
Mol. Mass.:
360.3148
SMILES:
COc1cc(C(O)=O)c2Oc3c(CO)c(O)cc(C)c3C(=O)Oc2c1C
: