Target
Protein RecA
Ligand
BDBM92388
Substrate
Meas. Tech.
Fluorescent Reporter Assay
IC50
2.3e+4±n/a nM
Citation
 Zhang, LZheng, YCallahan, BBelfort, MLiu, Y Cisplatin inhibits protein splicing, suggesting inteins as therapeutic targets in mycobacteria. J Biol Chem 286:1277-82 (2011)  
Target
Name:
Protein RecA
Synonyms:
RECA_ECOLI recA rnmB umuB | zab
Type:
Protein
Mol. Mass.:
37964.88
Organism:
Escherichia coli
Description:
C6EJT2
Residue:
353
  
Inhibitor
Name:
BDBM92388
Synonyms:
Oxaliplatin, 3
Type:
Small molecule
Emp. Form.:
C8H14N2O4Pt
Mol. Mass.:
397.292
SMILES:
O=C1O[Pt]OC1=O.NC1CCCCC1N
: