Target
Protein RecA
Ligand
BDBM92389
Substrate
Meas. Tech.
Fluorescent Reporter Assay
IC50
3.0e+4±n/a nM
Citation
 Zhang, LZheng, YCallahan, BBelfort, MLiu, Y Cisplatin inhibits protein splicing, suggesting inteins as therapeutic targets in mycobacteria. J Biol Chem 286:1277-82 (2011)  
Target
Name:
Protein RecA
Synonyms:
RECA_ECOLI recA rnmB umuB | zab
Type:
Protein
Mol. Mass.:
37964.88
Organism:
Escherichia coli
Description:
C6EJT2
Residue:
353
  
Inhibitor
Name:
BDBM92389
Synonyms:
Caronplatin, 4
Type:
Small molecule
Emp. Form.:
C6H12N2O4Pt
Mol. Mass.:
371.253
SMILES:
[NH3+][Pt]1([NH3+])OC(=O)C2(CCC2)C(=O)O1
: