Target
Protein RecA
Ligand
BDBM92390
Substrate
Meas. Tech.
Fluorescent Reporter Assay
IC50
5.0e+4±n/a nM
Citation
 Zhang, LZheng, YCallahan, BBelfort, MLiu, Y Cisplatin inhibits protein splicing, suggesting inteins as therapeutic targets in mycobacteria. J Biol Chem 286:1277-82 (2011)  
Target
Name:
Protein RecA
Synonyms:
RECA_ECOLI recA rnmB umuB | zab
Type:
Protein
Mol. Mass.:
37964.88
Organism:
Escherichia coli
Description:
C6EJT2
Residue:
353
  
Inhibitor
Name:
BDBM92390
Synonyms:
cDPCP, 5
Type:
Small molecule
Emp. Form.:
C5H11ClN3Pt
Mol. Mass.:
343.696
SMILES:
[NH3+][Pt]([NH3+])(Cl)[n+]1ccccc1
: