Target
Protein RecA
Ligand
BDBM92392
Substrate
Meas. Tech.
Fluorescent Reporter Assay
IC50
1.20e+5±n/a nM
Citation
 Zhang, LZheng, YCallahan, BBelfort, MLiu, Y Cisplatin inhibits protein splicing, suggesting inteins as therapeutic targets in mycobacteria. J Biol Chem 286:1277-82 (2011)  
Target
Name:
Protein RecA
Synonyms:
RECA_ECOLI recA rnmB umuB | zab
Type:
Protein
Mol. Mass.:
37964.88
Organism:
Escherichia coli
Description:
C6EJT2
Residue:
353
  
Inhibitor
Name:
BDBM92392
Synonyms:
Pt(NH3)2(3-py-Ch2OH)Cl, 7
Type:
Small molecule
Emp. Form.:
C6H12ClN3OPt
Mol. Mass.:
372.715
SMILES:
N[Pt]([NH3+])(Cl)[n+]1cccc(CO)c1
: