Target
Matrix metalloproteinase-14 [1-20,P8S]
Ligand
BDBM92488
Substrate
Meas. Tech.
Inhibition Assay
Temperature
310.15±0 K
IC50
1.09e+4±n/a nM
Citation
 Radichev, IARemacle, AGShiryaev, SAPurves, ANJohnson, SLPellecchia, MStrongin, AY Biochemical characterization of the cellular glycosylphosphatidylinositol-linked membrane type-6 matrix metalloproteinase. J Biol Chem 285:16076-86 (2010)  
Target
Name:
Matrix metalloproteinase-14 [1-20,P8S]
Synonyms:
MMP-14 MMP14 MT-MMP 1 MT1MMP Matrix metalloproteinase 14 Membrane-type matrix metalloproteinase 1 | Membrane-type-1 matrix metalloproteinase
Type:
Protein
Mol. Mass.:
2138.64
Organism:
Homo sapiens (Human)
Description:
Q8IXG1
Residue:
20
  
Inhibitor
Name:
BDBM92488
Synonyms:
BI-92G11
Type:
Small organic molecule
Emp. Form.:
C9H11NO4S
Mol. Mass.:
229.253
SMILES:
ONC(=O)CCS(=O)(=O)c1ccccc1
: