Target
72 kDa type IV collagenase
Ligand
BDBM92488
Substrate
Meas. Tech.
Inhibition Assay
Temperature
310.15±0 K
IC50
1.90e+3±n/a nM
Citation
 Radichev, IARemacle, AGShiryaev, SAPurves, ANJohnson, SLPellecchia, MStrongin, AY Biochemical characterization of the cellular glycosylphosphatidylinositol-linked membrane type-6 matrix metalloproteinase. J Biol Chem 285:16076-86 (2010)  
Target
Name:
72 kDa type IV collagenase
Synonyms:
72 kDa gelatinase CLG4A Gelatinase A (MMP-2) MMP2_HUMAN Matrix metalloproteinase-2 (MMP 2) Matrix metalloproteinases 2 (MMP-2) | TBE-1
Type:
Enzyme
Mol. Mass.:
73870.36
Organism:
Homo sapiens (Human)
Description:
P08253
Residue:
660
  
Inhibitor
Name:
BDBM92488
Synonyms:
BI-92G11
Type:
Small organic molecule
Emp. Form.:
C9H11NO4S
Mol. Mass.:
229.253
SMILES:
ONC(=O)CCS(=O)(=O)c1ccccc1
: