Target
Matrix metalloproteinase-9
Ligand
BDBM92488
Substrate
Meas. Tech.
Inhibition Assay
Temperature
310.15±0 K
IC50
>5.0e+4±n/a nM
Citation
 Radichev, IARemacle, AGShiryaev, SAPurves, ANJohnson, SLPellecchia, MStrongin, AY Biochemical characterization of the cellular glycosylphosphatidylinositol-linked membrane type-6 matrix metalloproteinase. J Biol Chem 285:16076-86 (2010)  
Target
Name:
Matrix metalloproteinase-9
Synonyms:
67 kDa matrix metalloproteinase-9 92 kDa gelatinase CLG4B Gelatinase B MMP9 Matrix metalloproteinase 9 (MMP-9) Matrix metalloproteinase-9 (MMP9)
Type:
Enzyme
Mol. Mass.:
78452.28
Organism:
Homo sapiens (Human)
Description:
P14780
Residue:
707
  
Inhibitor
Name:
BDBM92488
Synonyms:
BI-92G11
Type:
Small organic molecule
Emp. Form.:
C9H11NO4S
Mol. Mass.:
229.253
SMILES:
ONC(=O)CCS(=O)(=O)c1ccccc1
: