Target
Cytochrome P450 144
Ligand
BDBM31774
Substrate
Meas. Tech.
Binding Assay
Kd
3.7e+2± 8e+1 nM
Citation
 Driscoll, MDMcLean, KJLevy, CMast, NPikuleva, IALafite, PRigby, SELeys, DMunro, AW Structural and biochemical characterization of Mycobacterium tuberculosis CYP142: evidence for multiple cholesterol 27-hydroxylase activities in a human pathogen. J Biol Chem 285:38270-82 (2010)  
Target
Name:
Cytochrome P450 144
Synonyms:
CP144_MYCTO cyp144
Type:
Enzyme
Mol. Mass.:
47207.78
Organism:
Mycobacterium tuberculosis
Description:
P9WPL0
Residue:
434
  
Inhibitor
Name:
BDBM31774
Synonyms:
CHEMBL104 Clotrimazole Mycelex cid_2812
Type:
Small organic molecule
Emp. Form.:
C22H17ClN2
Mol. Mass.:
344.837
SMILES:
Clc1ccccc1C(c1ccccc1)(c1ccccc1)n1ccnc1
: