Target
Cytochrome P450 130
Ligand
BDBM92572
Substrate
Meas. Tech.
Binding Assay
Kd
5.52e+4± 2.2e+3 nM
Citation
 Podust, LMOuellet, Hvon Kries, JPde Montellano, PR Interaction of Mycobacterium tuberculosis CYP130 with heterocyclic arylamines. J Biol Chem 284:25211-9 (2009)  
Target
Name:
Cytochrome P450 130
Synonyms:
CP130_MYCTO cyp130
Type:
Enzyme
Mol. Mass.:
44574.98
Organism:
Mycobacterium tuberculosis
Description:
P9WPN4
Residue:
405
  
Inhibitor
Name:
BDBM92572
Synonyms:
Aniline | Ph-NH2
Type:
Small organic molecule
Emp. Form.:
C6H7N
Mol. Mass.:
93.1265
SMILES:
Nc1ccccc1
: