Target
Cytochrome P450 130
Ligand
BDBM92569
Substrate
Meas. Tech.
Binding Assay
Kd
4.9e+3± 3e+2 nM
Citation
 Podust, LMOuellet, Hvon Kries, JPde Montellano, PR Interaction of Mycobacterium tuberculosis CYP130 with heterocyclic arylamines. J Biol Chem 284:25211-9 (2009)  
Target
Name:
Cytochrome P450 130
Synonyms:
CP130_MYCTU Putative cytochrome P450 130 | cyp130
Type:
Enzyme
Mol. Mass.:
44574.98
Organism:
Mycobacterium tuberculosis
Description:
P9WPN5
Residue:
405
  
Inhibitor
Name:
BDBM92569
Synonyms:
Arylamine compound 2
Type:
Small organic molecule
Emp. Form.:
C20H15N3O2S
Mol. Mass.:
361.417
SMILES:
Nc1ccc(Sc2ccc(cc2)N2C(=O)c3ccc(N)cc3C2=O)cc1
: