Target
Cytochrome P450 130
Ligand
BDBM31774
Substrate
Meas. Tech.
Binding Assay
Kd
6.1e+3± 2e+2 nM
Citation
 Podust, LMOuellet, Hvon Kries, JPde Montellano, PR Interaction of Mycobacterium tuberculosis CYP130 with heterocyclic arylamines. J Biol Chem 284:25211-9 (2009)  
Target
Name:
Cytochrome P450 130
Synonyms:
CP130_MYCTU Putative cytochrome P450 130 | cyp130
Type:
Enzyme
Mol. Mass.:
44574.98
Organism:
Mycobacterium tuberculosis
Description:
P9WPN5
Residue:
405
  
Inhibitor
Name:
BDBM31774
Synonyms:
CHEMBL104 Clotrimazole Mycelex cid_2812
Type:
Small organic molecule
Emp. Form.:
C22H17ClN2
Mol. Mass.:
344.837
SMILES:
Clc1ccccc1C(c1ccccc1)(c1ccccc1)n1ccnc1
: