Target
Steroid C26-monooxygenase
Ligand
BDBM92569
Substrate
Meas. Tech.
Binding Assay
Kd
1.7e+2± 4e+1 nM
Citation
 Podust, LMOuellet, Hvon Kries, JPde Montellano, PR Interaction of Mycobacterium tuberculosis CYP130 with heterocyclic arylamines. J Biol Chem 284:25211-9 (2009)  
Target
Name:
Steroid C26-monooxygenase
Synonyms:
CP142_MYCTO Cytochrome P450 142 (CYP142) | cyp142
Type:
Enzyme
Mol. Mass.:
41422.72
Organism:
Mycobacterium tuberculosis
Description:
P9WPL4
Residue:
372
  
Inhibitor
Name:
BDBM92569
Synonyms:
Arylamine compound 2
Type:
Small organic molecule
Emp. Form.:
C20H15N3O2S
Mol. Mass.:
361.417
SMILES:
Nc1ccc(Sc2ccc(cc2)N2C(=O)c3ccc(N)cc3C2=O)cc1
: