Target
Trp operon repressor
Ligand
BDBM92682
Substrate
Meas. Tech.
Binding Assay
Kd
3.25e+3±n/a nM
Citation
 Marmorstein, RQJoachimiak, ASprinzl, MSigler, PB The structural basis for the interaction between L-tryptophan and the Escherichia coli trp aporepressor. J Biol Chem 262:4922-7 (1987) Target
Name:
Trp operon repressor
Synonyms:
TRPR_ECOLI Trp operon repressor trpR
Type:
Protein
Mol. Mass.:
12353.00
Organism:
Escherichia coli (strain K12)
Description:
P0A881
Residue:
108
  
Inhibitor
Name:
BDBM92682
Synonyms:
5-Methyl-L-tryptophan, 2
Type:
Small molecule
Emp. Form.:
C12H14N2O2
Mol. Mass.:
218.2518
SMILES:
Cc1ccc2[nH]cc(CC([NH3+])C([O-])=O)c2c1
: