Target
Trp operon repressor
Ligand
BDBM92684
Substrate
Meas. Tech.
Binding Assay
Kd
9.74e+3±n/a nM
Citation
 Marmorstein, RQJoachimiak, ASprinzl, MSigler, PB The structural basis for the interaction between L-tryptophan and the Escherichia coli trp aporepressor. J Biol Chem 262:4922-7 (1987) Target
Name:
Trp operon repressor
Synonyms:
TRPR_ECOLI Trp operon repressor trpR
Type:
Protein
Mol. Mass.:
12353.00
Organism:
Escherichia coli (strain K12)
Description:
P0A881
Residue:
108
  
Inhibitor
Name:
BDBM92684
Synonyms:
Indole-3-propionic acid, 4
Type:
Small molecule
Emp. Form.:
C11H10NO2
Mol. Mass.:
188.2031
SMILES:
[O-]C(=O)CCc1c[nH]c2ccccc12
: