Target
Trp operon repressor
Ligand
BDBM92685
Substrate
Meas. Tech.
Binding Assay
Kd
1.46e+4±n/a nM
Citation
 Marmorstein, RQJoachimiak, ASprinzl, MSigler, PB The structural basis for the interaction between L-tryptophan and the Escherichia coli trp aporepressor. J Biol Chem 262:4922-7 (1987) Target
Name:
Trp operon repressor
Synonyms:
TRPR_ECOLI Trp operon repressor trpR
Type:
Protein
Mol. Mass.:
12353.00
Organism:
Escherichia coli (strain K12)
Description:
P0A881
Residue:
108
  
Inhibitor
Name:
BDBM92685
Synonyms:
D-Tryptophan, 20 | L-Tryptophan, 5
Type:
Small molecule
Emp. Form.:
C11H12N2O2
Mol. Mass.:
204.2252
SMILES:
[NH3+]C(Cc1c[nH]c2ccccc12)C([O-])=O
: