Target
Trp operon repressor
Ligand
BDBM50094702
Substrate
Meas. Tech.
Binding Assay
Kd
2.51e+4±n/a nM
Citation
 Marmorstein, RQJoachimiak, ASprinzl, MSigler, PB The structural basis for the interaction between L-tryptophan and the Escherichia coli trp aporepressor. J Biol Chem 262:4922-7 (1987) Target
Name:
Trp operon repressor
Synonyms:
TRPR_ECOLI Trp operon repressor trpR
Type:
Protein
Mol. Mass.:
12353.00
Organism:
Escherichia coli (strain K12)
Description:
P0A881
Residue:
108
  
Inhibitor
Name:
BDBM50094702
Synonyms:
1H-indole Indol indole
Type:
Small organic molecule
Emp. Form.:
C8H7N
Mol. Mass.:
117.1479
SMILES:
c1cc2ccccc2[nH]1
: