Target
Trp operon repressor
Ligand
BDBM92687
Substrate
Meas. Tech.
Binding Assay
Kd
2.64e+4±n/a nM
Citation
 Marmorstein, RQJoachimiak, ASprinzl, MSigler, PB The structural basis for the interaction between L-tryptophan and the Escherichia coli trp aporepressor. J Biol Chem 262:4922-7 (1987) Target
Name:
Trp operon repressor
Synonyms:
TRPR_ECOLI Trp operon repressor trpR
Type:
Protein
Mol. Mass.:
12353.00
Organism:
Escherichia coli (strain K12)
Description:
P0A881
Residue:
108
  
Inhibitor
Name:
BDBM92687
Synonyms:
1-Methyl-L-tryptophan, 8
Type:
Small molecule
Emp. Form.:
C12H13N2O2
Mol. Mass.:
217.2444
SMILES:
Cn1cc(CC(N)C([O-])=O)c2ccccc12
: