Target
Trp operon repressor
Ligand
BDBM92688
Substrate
Meas. Tech.
Binding Assay
Kd
2.77e+4±n/a nM
Citation
 Marmorstein, RQJoachimiak, ASprinzl, MSigler, PB The structural basis for the interaction between L-tryptophan and the Escherichia coli trp aporepressor. J Biol Chem 262:4922-7 (1987) Target
Name:
Trp operon repressor
Synonyms:
TRPR_ECOLI Trp operon repressor trpR
Type:
Protein
Mol. Mass.:
12353.00
Organism:
Escherichia coli (strain K12)
Description:
P0A881
Residue:
108
  
Inhibitor
Name:
BDBM92688
Synonyms:
L-Tryptophanamide, 9
Type:
Small molecule
Emp. Form.:
C11H13N3O
Mol. Mass.:
203.2404
SMILES:
NC(Cc1c[nH]c2ccccc12)C(N)=O
: