Target
Trp operon repressor
Ligand
BDBM92694
Substrate
Meas. Tech.
Binding Assay
Kd
7.29e+4±n/a nM
Citation
 Marmorstein, RQJoachimiak, ASprinzl, MSigler, PB The structural basis for the interaction between L-tryptophan and the Escherichia coli trp aporepressor. J Biol Chem 262:4922-7 (1987) Target
Name:
Trp operon repressor
Synonyms:
TRPR_ECOLI Trp operon repressor trpR
Type:
Protein
Mol. Mass.:
12353.00
Organism:
Escherichia coli (strain K12)
Description:
P0A881
Residue:
108
  
Inhibitor
Name:
BDBM92694
Synonyms:
Indole-3-acetic acid, 16
Type:
Small molecule
Emp. Form.:
C10H8NO2
Mol. Mass.:
174.1766
SMILES:
[O-]C(=O)Cc1c[nH]c2ccccc12
: