Target
Trp operon repressor
Ligand
BDBM92697
Substrate
Meas. Tech.
Binding Assay
Kd
1.74e+5±n/a nM
Citation
 Marmorstein, RQJoachimiak, ASprinzl, MSigler, PB The structural basis for the interaction between L-tryptophan and the Escherichia coli trp aporepressor. J Biol Chem 262:4922-7 (1987) Target
Name:
Trp operon repressor
Synonyms:
TRPR_ECOLI Trp operon repressor trpR
Type:
Protein
Mol. Mass.:
12353.00
Organism:
Escherichia coli (strain K12)
Description:
P0A881
Residue:
108
  
Inhibitor
Name:
BDBM92697
Synonyms:
Indoline, 19
Type:
Small molecule
Emp. Form.:
C8H9N
Mol. Mass.:
119.1638
SMILES:
C1Cc2ccccc2N1
: