Target
Trp operon repressor
Ligand
BDBM92702
Substrate
Meas. Tech.
Binding Assay
Kd
>3.000e+6±n/a nM
Citation
 Marmorstein, RQJoachimiak, ASprinzl, MSigler, PB The structural basis for the interaction between L-tryptophan and the Escherichia coli trp aporepressor. J Biol Chem 262:4922-7 (1987) Target
Name:
Trp operon repressor
Synonyms:
TRPR_ECOLI Trp operon repressor trpR
Type:
Protein
Mol. Mass.:
12353.00
Organism:
Escherichia coli (strain K12)
Description:
P0A881
Residue:
108
  
Inhibitor
Name:
BDBM92702
Synonyms:
L-Tyrosine, 24
Type:
Small molecule
Emp. Form.:
C9H11NO3
Mol. Mass.:
181.1885
SMILES:
[NH3+]C(Cc1ccc(O)cc1)C([O-])=O
: