Target
Nociceptin receptor
Ligand
BDBM85822
Substrate
Ki
262±n/a nM
Comments
PDSP_2098
Citation
 Mogil, JSPasternak, GW The molecular and behavioral pharmacology of the orphanin FQ/nociceptin peptide and receptor family. Pharmacol Rev 53:381-415 (2001) Target
Name:
Nociceptin receptor
Synonyms:
K3 opiate receptor Kappa-type 3 opioid receptor Nociceptin/Orphanin FQ, NOP receptor ORGC Oprl Orphanin FQ receptor
Type:
Enzyme Catalytic Domain
Mol. Mass.:
40499.09
Organism:
MOUSE
Description:
Nociceptin/Orphanin FQ, NOP receptor 0 MOUSE::P35377
Residue:
367
  
Inhibitor
Name:
BDBM85822
Synonyms:
Demethyl-AMPA OFQ/N (1-11) | OFQ/N (1-11),[Tyr10]
Type:
Small organic molecule
Emp. Form.:
C61H100N22O15
Mol. Mass.:
1381.5851
SMILES:
[#6]-[#6@@H](-[#8])-[#6@H](-[#7]-[#6](=O)-[#6@H](-[#6]-c1ccccc1)-[#7]-[#6](=O)-[#6]-[#7]-[#6](=O)-[#6]-[#7]-[#6](=O)-[#6@@H](-[#7])-[#6]-c1ccccc1)-[#6](=O)-[#7]-[#6]-[#6](=O)-[#7]-[#6@@H](-[#6])-[#6](=O)-[#7]-[#6@@H](-[#6]-[#6]-[#6]\[#7]=[#6](\[#7])-[#7])-[#6](=O)-[#7]-[#6@@H](-[#6]-[#6]-[#6]-[#6]-[#7])-[#6](=O)-[#7]-[#6@@H](-[#6]-[#8])-[#6](=O)-[#7]-[#6@@H](-[#6])-[#6](=O)-[#7]-[#6@@H](-[#6]-[#6]-[#6]\[#7]=[#6](\[#7])-[#7])-[#6](=O)-[#7]-[#6@@H](-[#6]-[#6]-[#6]-[#6]-[#7])-[#6](-[#7])=O
: