Target
Nitric oxide synthase, endothelial
Ligand
BDBM50341682
Substrate
Meas. Tech.
Inhibitory Assay
Ki
2680±0.0 nM
Citation
 Delker, SLXue, FLi, HJamal, JSilverman, RBPoulos, TL Role of zinc in isoform-selective inhibitor binding to neuronal nitric oxide synthase . Biochemistry 49:10803-10 (2010)  
Target
Name:
Nitric oxide synthase, endothelial
Synonyms:
Constitutive NOS Endothelial NOS NOS type III NOS3_HUMAN Nitric oxide synthase (inducible and endothelial) Nitric-oxide synthase (endothelial and brain) eNOS
Type:
Enzyme Catalytic Domain
Mol. Mass.:
133297.84
Organism:
Homo sapiens (Human)
Description:
P29474
Residue:
1203
  
Inhibitor
Name:
BDBM50341682
Synonyms:
6,6'-(2,2'-(Pyridine-3,5-diyl)bis(ethane-2,1-diyl))bis(4methylpyridin-2-amine) CHEMBL1615288 US10759791, Compound 2a | US9951014, Name 2a
Type:
Small organic molecule
Emp. Form.:
C21H25N5
Mol. Mass.:
347.4567
SMILES:
Cc1cc(N)nc(CCc2cncc(CCc3cc(C)cc(N)n3)c2)c1
: