Target
Isochorismatase family protein
Ligand
BDBM50026863
Substrate
Meas. Tech.
GDH-Coupled Nicotinamidase Assay
Ki
11±1 nM
Citation
 French, JBCen, YVrablik, TLXu, PAllen, EHanna-Rose, WSauve, AA Characterization of nicotinamidases: steady state kinetic parameters, classwide inhibition by nicotinaldehydes, and catalytic mechanism. Biochemistry 49:10421-39 (2010)  
Target
Name:
Isochorismatase family protein
Synonyms:
Nicotinamidase (SpNic) | Pyrazinamidase/nicotinamidase
Type:
Enzyme
Mol. Mass.:
21361.69
Organism:
Streptococcus pneumoniae
Description:
A0A098ZGI7
Residue:
191
  
Inhibitor
Name:
BDBM50026863
Synonyms:
CHEMBL268493 PncA Inhibitor, 2 | Pyridine-3-carbaldehyde
Type:
Small organic molecule
Emp. Form.:
C6H5NO
Mol. Mass.:
107.11
SMILES:
O=Cc1cccnc1
: